{"text_format":"1","workbook":"xlsx","n_sheets":8,"sheets":["Instructions","Roll Up","Case Aide","Provider Level","Fee Table","Offices","Drop Down","IndexMatch"],"not_rendered":{"charts":0,"images":2,"macros":0,"external_links":1,"defined_names":15,"comments":0,"pivot_tables":0},"unopened":[],"bounds":{"document_bytes":16777216,"sheet_cells":100000,"rows_first":2000,"rows_last":500,"rows_between":2000,"halvings":0,"cell_chars":16384,"cell_head_chars":4096},"cells_cut":0,"cells_raw":0,"read":"whole","date_system":"1900"}

{"sheet":"Instructions","index":0,"n_rows":70,"n_cols":4,"rows_kept":70,"cut":false,"hidden":false,"merged":[[1,1,2,19]]}
[]
[null,"Catchment Case Aide & Provider Resource billing form Instructions"]
[]
[]
[]
[]
[null,null,"Catchment Case Aide & Provider Resource Roll Up "]
[null,null,"The Roll-Up tab is a billing summary using the data from the \"Case Aide\" tab and \"Provider Level\" tab to generate the invoice broken down by DCYF Region."]
[]
[null,null,"The only action required on this tab is the completion of the header:"]
[]
[]
[]
[]
[]
[]
[]
[]
[]
[]
{"$rows_left_out":51}
{"sheet":"Roll Up","index":1,"n_rows":98,"n_cols":10,"rows_kept":98,"cut":false,"hidden":false,"merged":[[9,1,9,10],[30,4,30,6],[18,9,19,10],[18,8,19,8],[21,4,21,6],[12,2,15,10],[18,2,19,6],[27,2,28,6],[22,4,22,6],[23,4,23,6],[27,8,28,8],[91,9,93,9],[92,1,93,5],[63,2,64,6],[77,4,77,6],[75,4,75,6],[76,4,76,6],[72,2,73,2],[72,8,73,8],[72,9,73,10],[66,4,66,6],[67,4,67,6],[68,4,68,6],[63,8,64,8],[63,9,64,10],[89,1,90,8],[27,9,28,10],[31,4,31,6],[32,4,32,6],[57,4,57,6],[58,4,58,6],[54,9,55,10],[45,9,46,10],[48,4,48,6],[49,4,49,6],[54,2,55,6],[39,4,39,6],[40,4,40,6],[36,8,37,8],[36,2,37,6],[36,9,37,10],[59,4,59,6],[54,8,55,8],[41,4,41,6],[45,8,46,8],[45,2,46,6],[50,4,50,6]]}
[null,null,null,null,"WASHINGTON STATE DEPARTMENT OF CHILDREN, YOUTH, AND FAMILIES"]
[null,null,null,null,"Catchment Provider Billing Form"]
[]
[null,null,"Month of Service:",null,"Select",null,"Year:",null,"Select"]
[]
[null,null,"Provider Name:"]
[]
[null,null,"FamLink Provider #:"]
[]
[null,"Please Complete the \"Case Aide\" and \"Provider Level\" Tab"]
[]
[]
[null,null,"- This Billing Form is Meant to provide a monthly invoice for case aide.\n- Provider Resource Support Levels will be opened independently without the need for paperwork; however, this form allows for the catchment to note which cases have not received an invoice for Provider Resource Support to reduce delays in payment."]
[]
[]
[]
[]
[]
[null,null,"Region 1: Mileage is Paid Lump Sum",null,null,null,null,null,"Dollar Amounts","Count"]
[]
{"$rows_left_out":79}
{"sheet":"Case Aide","index":2,"n_rows":494,"n_cols":21,"rows_kept":494,"cut":false,"hidden":false,"merged":[]}
["Month of Service","Child Name","Child ID","Case Name","Case Number","Is Youth TPO?","Tribe Name","Opt in Date","Opt Out Date","County Where Youth Resides","DCYF Case Region","DCYF Case Office","Child Support Level","Case Aide Hours","Hide Column","Case Aide Travel Time","Total Case Aide","Case Aide Due","Is Billing Allowed","Mileage","Mileage Due (Paid by Lump Sum)"]
["Select","-","-","-","-","Select",null,"DD/MM/YYYY","DD/MM/YYYY","Select","Select","Select","Select",0,{"$f":"IF(N2>VLOOKUP(M2,'Drop Down'!$A$3:$B$10,2,0),\"1\",\"0\")","v":"0"},0,{"$f":"SUM($N2,$P2)","v":0},{"$f":"IFERROR(IF(M2=\"Select\",\"Select Support Level\", PRODUCT($Q2,VLOOKUP($J2,'Drop Down'!K:M,3,0))),\"-\")","v":"Select Support Level"},{"$f":"IF(O2=\"1\",\"Cannot Bill\",\"Ok\")","v":"Ok"},0,{"$f":"IF($T2=\"\",0,ROUND(PRODUCT(T2,0.7),2))","v":0}]
["Select","-","-","-","-","Select",null,"DD/MM/YYYY","DD/MM/YYYY","Select","Select","Select","Select",0,{"$f":"IF(N3>VLOOKUP(M3,'Drop Down'!$A$3:$B$10,2,0),\"1\",\"0\")","v":"0"},0,0,{"$f":"IFERROR(IF(M3=\"Select\",\"Select Support Level\", PRODUCT($Q3,VLOOKUP($J3,'Drop Down'!K:M,3,0))),\"-\")","v":"Select Support Level"},"Ok",0,0]
["Select","-","-","-","-","Select",null,"DD/MM/YYYY","DD/MM/YYYY","Select","Select","Select","Select",0,{"$f":"IF(N4>VLOOKUP(M4,'Drop Down'!$A$3:$B$10,2,0),\"1\",\"0\")","v":"0"},0,0,{"$f":"IFERROR(IF(M4=\"Select\",\"Select Support Level\", PRODUCT($Q4,VLOOKUP($J4,'Drop Down'!K:M,3,0))),\"-\")","v":"Select Support Level"},"Ok",0,0]
["Select","-","-","-","-","Select",null,"DD/MM/YYYY","DD/MM/YYYY","Select","Select","Select","Select",0,{"$f":"IF(N5>VLOOKUP(M5,'Drop Down'!$A$3:$B$10,2,0),\"1\",\"0\")","v":"0"},0,0,{"$f":"IFERROR(IF(M5=\"Select\",\"Select Support Level\", PRODUCT($Q5,VLOOKUP($J5,'Drop Down'!K:M,3,0))),\"-\")","v":"Select Support Level"},"Ok",0,0]
["Select","-","-","-","-","Select",null,"DD/MM/YYYY","DD/MM/YYYY","Select","Select","Select","Select",0,{"$f":"IF(N6>VLOOKUP(M6,'Drop Down'!$A$3:$B$10,2,0),\"1\",\"0\")","v":"0"},0,0,{"$f":"IFERROR(IF(M6=\"Select\",\"Select Support Level\", PRODUCT($Q6,VLOOKUP($J6,'Drop Down'!K:M,3,0))),\"-\")","v":"Select Support Level"},"Ok",0,0]
["Select","-","-","-","-","Select",null,"DD/MM/YYYY","DD/MM/YYYY","Select","Select","Select","Select",0,{"$f":"IF(N7>VLOOKUP(M7,'Drop Down'!$A$3:$B$10,2,0),\"1\",\"0\")","v":"0"},0,0,{"$f":"IFERROR(IF(M7=\"Select\",\"Select Support Level\", PRODUCT($Q7,VLOOKUP($J7,'Drop Down'!K:M,3,0))),\"-\")","v":"Select Support Level"},"Ok",0,0]
["Select","-","-","-","-","Select",null,"DD/MM/YYYY","DD/MM/YYYY","Select","Select","Select","Select",0,{"$f":"IF(N8>VLOOKUP(M8,'Drop Down'!$A$3:$B$10,2,0),\"1\",\"0\")","v":"0"},0,0,{"$f":"IFERROR(IF(M8=\"Select\",\"Select Support Level\", PRODUCT($Q8,VLOOKUP($J8,'Drop Down'!K:M,3,0))),\"-\")","v":"Select Support Level"},"Ok",0,0]
["Select","-","-","-","-","Select",null,"DD/MM/YYYY","DD/MM/YYYY","Select","Select","Select","Select",0,{"$f":"IF(N9>VLOOKUP(M9,'Drop Down'!$A$3:$B$10,2,0),\"1\",\"0\")","v":"0"},0,0,{"$f":"IFERROR(IF(M9=\"Select\",\"Select Support Level\", PRODUCT($Q9,VLOOKUP($J9,'Drop Down'!K:M,3,0))),\"-\")","v":"Select Support Level"},"Ok",0,0]
["Select","-","-","-","-","Select",null,"DD/MM/YYYY","DD/MM/YYYY","Select","Select","Select","Select",0,{"$f":"IF(N10>VLOOKUP(M10,'Drop Down'!$A$3:$B$10,2,0),\"1\",\"0\")","v":"0"},0,0,{"$f":"IFERROR(IF(M10=\"Select\",\"Select Support Level\", PRODUCT($Q10,VLOOKUP($J10,'Drop Down'!K:M,3,0))),\"-\")","v":"Select Support Level"},"Ok",0,0]
["Select","-","-","-","-","Select",null,"DD/MM/YYYY","DD/MM/YYYY","Select","Select","Select","Select",0,{"$f":"IF(N11>VLOOKUP(M11,'Drop Down'!$A$3:$B$10,2,0),\"1\",\"0\")","v":"0"},0,0,{"$f":"IFERROR(IF(M11=\"Select\",\"Select Support Level\", PRODUCT($Q11,VLOOKUP($J11,'Drop Down'!K:M,3,0))),\"-\")","v":"Select Support Level"},"Ok",0,0]
["Select","-","-","-","-","Select",null,"DD/MM/YYYY","DD/MM/YYYY","Select","Select","Select","Select",0,{"$f":"IF(N12>VLOOKUP(M12,'Drop Down'!$A$3:$B$10,2,0),\"1\",\"0\")","v":"0"},0,0,{"$f":"IFERROR(IF(M12=\"Select\",\"Select Support Level\", PRODUCT($Q12,VLOOKUP($J12,'Drop Down'!K:M,3,0))),\"-\")","v":"Select Support Level"},"Ok",0,0]
["Select","-","-","-","-","Select",null,"DD/MM/YYYY","DD/MM/YYYY","Select","Select","Select","Select",0,{"$f":"IF(N13>VLOOKUP(M13,'Drop Down'!$A$3:$B$10,2,0),\"1\",\"0\")","v":"0"},0,0,{"$f":"IFERROR(IF(M13=\"Select\",\"Select Support Level\", PRODUCT($Q13,VLOOKUP($J13,'Drop Down'!K:M,3,0))),\"-\")","v":"Select Support Level"},"Ok",0,0]
["Select","-","-","-","-","Select",null,"DD/MM/YYYY","DD/MM/YYYY","Select","Select","Select","Select",0,{"$f":"IF(N14>VLOOKUP(M14,'Drop Down'!$A$3:$B$10,2,0),\"1\",\"0\")","v":"0"},0,0,{"$f":"IFERROR(IF(M14=\"Select\",\"Select Support Level\", PRODUCT($Q14,VLOOKUP($J14,'Drop Down'!K:M,3,0))),\"-\")","v":"Select Support Level"},"Ok",0,0]
["Select","-","-","-","-","Select",null,"DD/MM/YYYY","DD/MM/YYYY","Select","Select","Select","Select",0,{"$f":"IF(N15>VLOOKUP(M15,'Drop Down'!$A$3:$B$10,2,0),\"1\",\"0\")","v":"0"},0,0,{"$f":"IFERROR(IF(M15=\"Select\",\"Select Support Level\", PRODUCT($Q15,VLOOKUP($J15,'Drop Down'!K:M,3,0))),\"-\")","v":"Select Support Level"},"Ok",0,0]
["Select","-","-","-","-","Select",null,"DD/MM/YYYY","DD/MM/YYYY","Select","Select","Select","Select",0,{"$f":"IF(N16>VLOOKUP(M16,'Drop Down'!$A$3:$B$10,2,0),\"1\",\"0\")","v":"0"},0,0,{"$f":"IFERROR(IF(M16=\"Select\",\"Select Support Level\", PRODUCT($Q16,VLOOKUP($J16,'Drop Down'!K:M,3,0))),\"-\")","v":"Select Support Level"},"Ok",0,0]
["Select","-","-","-","-","Select",null,"DD/MM/YYYY","DD/MM/YYYY","Select","Select","Select","Select",0,{"$f":"IF(N17>VLOOKUP(M17,'Drop Down'!$A$3:$B$10,2,0),\"1\",\"0\")","v":"0"},0,0,{"$f":"IFERROR(IF(M17=\"Select\",\"Select Support Level\", PRODUCT($Q17,VLOOKUP($J17,'Drop Down'!K:M,3,0))),\"-\")","v":"Select Support Level"},"Ok",0,0]
["Select","-","-","-","-","Select",null,"DD/MM/YYYY","DD/MM/YYYY","Select","Select","Select","Select",0,{"$f":"IF(N18>VLOOKUP(M18,'Drop Down'!$A$3:$B$10,2,0),\"1\",\"0\")","v":"0"},0,0,{"$f":"IFERROR(IF(M18=\"Select\",\"Select Support Level\", PRODUCT($Q18,VLOOKUP($J18,'Drop Down'!K:M,3,0))),\"-\")","v":"Select Support Level"},"Ok",0,0]
["Select","-","-","-","-","Select",null,"DD/MM/YYYY","DD/MM/YYYY","Select","Select","Select","Select",0,{"$f":"IF(N19>VLOOKUP(M19,'Drop Down'!$A$3:$B$10,2,0),\"1\",\"0\")","v":"0"},0,0,{"$f":"IFERROR(IF(M19=\"Select\",\"Select Support Level\", PRODUCT($Q19,VLOOKUP($J19,'Drop Down'!K:M,3,0))),\"-\")","v":"Select Support Level"},"Ok",0,0]
["Select","-","-","-","-","Select",null,"DD/MM/YYYY","DD/MM/YYYY","Select","Select","Select","Select",0,{"$f":"IF(N20>VLOOKUP(M20,'Drop Down'!$A$3:$B$10,2,0),\"1\",\"0\")","v":"0"},0,0,{"$f":"IFERROR(IF(M20=\"Select\",\"Select Support Level\", PRODUCT($Q20,VLOOKUP($J20,'Drop Down'!K:M,3,0))),\"-\")","v":"Select Support Level"},"Ok",0,0]
{"$rows_left_out":475}
{"sheet":"Provider Level","index":3,"n_rows":494,"n_cols":14,"rows_kept":494,"cut":false,"hidden":false,"merged":[]}
["Month of Service","Child Name","Child ID","Case Name","Case Number","Is Youth TPO?","Tribe Name","Opt in Date","Opt Out Date","County Where Youth Resides","DCYF Case Region","DCYF Case Office","Child Support Level","Has Payment Been Opened for Provider Resource Support"]
["Select","-","-","-","-","Select",null,"DD/MM/YYYY","DD/MM/YYYY","Select","Select","Select","Select","Select"]
["Select","-","-","-","-","Select",null,"DD/MM/YYYY","DD/MM/YYYY","Select","Select","Select","Select","Select"]
["Select","-","-","-","-","Select",null,"DD/MM/YYYY","DD/MM/YYYY","Select","Select","Select","Select","Select"]
["Select","-","-","-","-","Select",null,"DD/MM/YYYY","DD/MM/YYYY","Select","Select","Select","Select","Select"]
["Select","-","-","-","-","Select",null,"DD/MM/YYYY","DD/MM/YYYY","Select","Select","Select","Select","Select"]
["Select","-","-","-","-","Select",null,"DD/MM/YYYY","DD/MM/YYYY","Select","Select","Select","Select","Select"]
["Select","-","-","-","-","Select",null,"DD/MM/YYYY","DD/MM/YYYY","Select","Select","Select","Select","Select"]
["Select","-","-","-","-","Select",null,"DD/MM/YYYY","DD/MM/YYYY","Select","Select","Select","Select","Select"]
["Select","-","-","-","-","Select",null,"DD/MM/YYYY","DD/MM/YYYY","Select","Select","Select","Select","Select"]
["Select","-","-","-","-","Select",null,"DD/MM/YYYY","DD/MM/YYYY","Select","Select","Select","Select","Select"]
["Select","-","-","-","-","Select",null,"DD/MM/YYYY","DD/MM/YYYY","Select","Select","Select","Select","Select"]
["Select","-","-","-","-","Select",null,"DD/MM/YYYY","DD/MM/YYYY","Select","Select","Select","Select","Select"]
["Select","-","-","-","-","Select",null,"DD/MM/YYYY","DD/MM/YYYY","Select","Select","Select","Select","Select"]
["Select","-","-","-","-","Select",null,"DD/MM/YYYY","DD/MM/YYYY","Select","Select","Select","Select","Select"]
["Select","-","-","-","-","Select",null,"DD/MM/YYYY","DD/MM/YYYY","Select","Select","Select","Select","Select"]
["Select","-","-","-","-","Select",null,"DD/MM/YYYY","DD/MM/YYYY","Select","Select","Select","Select","Select"]
["Select","-","-","-","-","Select",null,"DD/MM/YYYY","DD/MM/YYYY","Select","Select","Select","Select","Select"]
["Select","-","-","-","-","Select",null,"DD/MM/YYYY","DD/MM/YYYY","Select","Select","Select","Select","Select"]
["Select","-","-","-","-","Select",null,"DD/MM/YYYY","DD/MM/YYYY","Select","Select","Select","Select","Select"]
{"$rows_left_out":475}
{"sheet":"Fee Table","index":4,"n_rows":106,"n_cols":17,"rows_kept":106,"cut":false,"hidden":false,"merged":[[32,2,32,16],[1,2,1,16],[2,2,2,16],[4,2,4,16],[6,3,6,4],[6,5,6,8],[6,9,6,13],[26,2,26,16],[28,3,28,4],[28,5,28,8],[28,9,28,14],[28,15,28,16],[45,2,45,16],[58,2,58,16],[62,2,62,3],[82,2,86,2],[87,2,105,2]]}
[]
[null,null,"Caregiver Fee Table "]
[null,null,"Effective April 1, 2024\nreviesed June 7, 2024"]
[]
[null,null,"Base Case Rate and Hourly Rate"]
[]
[null,null,null,"Zone 1",null,"Zone 2",null,null,null,"Zone 3",null,null,null,null,"Zone 4"]
[null,null,null,"Northeast","South-Central","Pacific Mountain","South-East","North-Central ","Central ","South-West","Olympic","Tacoma-Pierce","Snohomish","North-West","Seattle-King"]
[]
[null,null,"Estimated Daily census"]
[]
[null,null,"Resource Support Lvl 1",495,495,529,529,529,529,508,508,508,508,508,564]
[null,null,"Resource Support Lvl 2",532,532,569,569,569,569,547,547,547,547,547,607]
[null,null,"Resource Support Lvl 3",577,577,616,616,616,616,592,592,592,592,592,657]
[null,null,"Resource Support Lvl 4",631,631,673,673,673,673,648,648,648,648,648,718]
[null,null,"Resource Support Lvl 5",782,782,834,834,834,834,803,803,803,803,803,890]
[null,null,"Resource Support Lvl 6",833,833,889,889,889,889,855,855,855,855,855,948]
[null,null,"Resource Support Lvl 7",961,961,1025,1025,1025,1025,987,987,987,987,987,1093]
[]
[]
{"$rows_left_out":87}
{"sheet":"Offices","index":5,"n_rows":123,"n_cols":20,"rows_kept":123,"cut":false,"hidden":true,"merged":[]}
["cd_dept_unit","tx_dept_unit","cd_dept_unit","tx_ofc_div",null,null,null,"Reasions",null,null,"Select"]
[772,"DJR Region 1",772,"Region 1",{"$error":"#N/A"},null,null,"[Select]",null,null,"Finished",null,null,"Select","Select","Select","Select","Select","Select","Select"]
[721,"Clarkston",721,"Region 1",5,null,null,"PCA Issue",null,null,"Not Finished",null,null,null,"Clarkston","White Salmon","Tribal Payment Only","Martin Luther King Jr. ","Parkland (Satellite)","Forks"]
[717,"Republic",717,"Region 1",7,null,null,"Insufficient Info In CLU",null,null,null,null,null,null,"Republic","Goldendale","Region 3 Adoptions"," Office of Indian Child Welfare - R04","R5 S'Klallam Tribe","Port Townsend"]
[716,"Colfax",716,"Region 1",16,null,null,"FA Error",null,null,null,null,null,null,"Colfax","Region 2 Facility Investigation","Region 3 Facility Investigation","Region 4 Family Treatment Court","Puyallup ","Olympia DCFS (Tumwater)"]
[715,"Colville",715,"Region 1",12,null,null,"Placement Correction",null,null,null,null,null,null,"Colville","Sunnyside","Sky Valley","King West DCFS","Region 5 Facility Investigation","South Bend"]
[714,"Spokane Central",714,"Region 1",9,null,null,"Provider Issue",null,null,null,null,null,null,"Spokane Central","Toppenish","Friday Harbor","King South-West","Tacoma ","Shelton"]
[713,"Omak",713,"Region 1",22,null,null,"FamLink Error",null,null,null,null,null,null,"Omak","Yakima","Oak Harbor","Region 4 Adoptions","Bremerton","Centralia"]
[712,"Moses Lake",712,"Region 1",18,null,null,"Insufficient Paperwork",null,null,null,null,null,null,"Moses Lake","Walla Walla","Smokey Point","West Seattle DCFS","Region 5 Adoptions","Aberdeen"]
[711,"Wenatchee",711,"Region 1",19,null,null,"Weekend Placement",null,null,null,null,null,null,"Wenatchee","Ellensburg DCFS","Lynnwood","King East DCFS","Lakewood","Kelso"]
[710,"Newport",710,"Region 1",10,null,null,"Respite",null,null,null,null,null,null,"Newport","Tri-Cities","Bellingham","Reg 4 AS","Vancouver - Clark","Vancouver - Cascade"]
[709,"Lincoln County (Spokane/Lincoln)",709,"Region 1",17,null,null,null,null,null,null,null,null,null,"Lincoln County (Spokane/Lincoln)","Region 2 ","Everett","King South-East","Reg 5 AS","Port Angeles"]
[708,"Region 1 Facility Investigation",708,"Region 1",{"$error":"#N/A"},null,null,null,null,null,null,null,null,null,"Region 1 Facility Investigation","Region 2 Adoptions","Mount Vernon","Martin Luther King Jr. Office","Tacoma","Long Beach"]
[701,"Region 1 ",701,"Region 1",88,null,null,null,null,null,null,null,null,null,"Region 1 ","Reg 2 AS","Bellingham","Office of Indian Child Welfare - R04","Bremerton","Stevenson"]
[695,"Spokane ICW",695,"Region 1",77,null,null,null,null,null,null,null,null,null,"Spokane ICW","Ellensburg",null,null,"Parkland","Vancouver - Columbia"]
[694,"Spokane Valley",694,"Region 1",76,null,null,null,null,null,null,null,null,null,"Spokane Valley","Region 2 Office",null,null,"Puyallup Office","Reg 6 AS"]
[693,"Spokane North",693,"Region 1",11,null,null,null,null,null,null,null,null,null,"Spokane North",null,null,null,"Tacoma Office","Vancouver"]
[681,"Region 1 Adoptions",null,"Region 1",null,null,null,null,null,null,null,null,null,null,"Region 1 Adoptions",null,null,null,"Region 5 Office","Olympia"]
[601,"Reg 1 AS",601,"Region 1",{"$error":"#N/A"},null,null,null,null,null,null,null,null,null,"Reg 1 AS",null,null,null,null,"Aberdeen"]
[null,"Spokane",null,"Region 1",null,null,null,null,null,null,null,null,null,null,"Spokane",null,null,null,null,"Forks DCYF"]
{"$rows_left_out":104}
{"sheet":"Drop Down","index":6,"n_rows":63,"n_cols":20,"rows_kept":63,"cut":false,"hidden":true,"merged":[]}
[]
[]
["Select",0,null,"Select","Select","Select","Select","Select","Select",null,"Select",null,"Case Aide","Support Services Lvl 1","Support Services Lvl 2","Support Services Lvl 3","Support Services Lvl 4","Support Services Lvl 5","Support Services Lvl 6","Support Services Lvl 7"]
["Catchment Provider Resource Level Lv1 ",0,null,"Yes","One",1,"One",2023,"January",null,"Select","Select County",0,0,0,0,0,0,0,0]
["Catchment Provider Resource Level Lv2",0,null,"No","Two",2,"Two",2024,"February",null,"Lincoln","Zone 1",29.005600000000001,495,532,577,631,782,833,961]
["Catchment Provider Resource Level Lv3",9,null,null,"Three",3,"Three",2025,"March",null,"Klickitat","Zone 1",29.005600000000001,495,532,577,631,782,833,961]
["Catchment Provider Resource Level Lv4",12,null,null,"Four",4,"Four",2026,"April",null,"Pend Oreille","Zone 1",29.005600000000001,495,532,577,631,782,833,961]
["Catchment Provider Resource Level Lv5",15,null,null,"Five",5,"Five",2027,"May",null,"Spokane","Zone 1",29.005600000000001,495,532,577,631,782,833,961]
["Catchment Provider Resource Level Lv6",17,null,null,"Six",6,"Six",2028,"June",null,"Stevens","Zone 1",29.005600000000001,495,532,577,631,782,833,961]
["Catchment Provider Resource Level Lv7",20,null,null,null,null,null,2029,"July",null,"Yakima","Zone 1",29.005600000000001,495,532,577,631,782,833,961]
[null,null,null,null,null,null,null,2030,"August",null,"Adams","Zone 2",30.076800000000002,529,569,616,673,834,889,1025]
[null,null,null,null,null,null,null,2031,"September",null,"Asotin","Zone 2",30.076800000000002,529,569,616,673,834,889,1025]
[null,null,null,null,null,null,null,2032,"October",null,"Benton","Zone 2",30.076800000000002,529,569,616,673,834,889,1025]
[null,null,null,null,null,null,null,2033,"November",null,"Chelan","Zone 2",30.076800000000002,529,569,616,673,834,889,1025]
[null,null,null,null,null,null,null,2034,"December",null,"Columbia","Zone 2",30.076800000000002,529,569,616,673,834,889,1025]
[null,null,null,null,null,null,null,null,null,null,"Douglas","Zone 2",30.076800000000002,529,569,616,673,834,889,1025]
[null,null,null,null,"Zone 1","Support Services Lvl 3",{"$f":"INDEX(D36:D42,MATCH(1,(B36:B42=E17)*(C36:C42=F17),0))","v":577},null,null,null,"Ferry","Zone 2",30.076800000000002,529,569,616,673,834,889,1025]
[null,null,null,null,null,null,null,null,null,null,"Franklin","Zone 2",30.076800000000002,529,569,616,673,834,889,1025]
[null,null,null,null,null,null,null,null,null,null,"Garfield","Zone 2",30.076800000000002,529,569,616,673,834,889,1025]
[null,null,null,null,null,null,null,null,null,null,"Grant","Zone 2",30.076800000000002,529,569,616,673,834,889,1025]
{"$rows_left_out":44}
{"sheet":"IndexMatch","index":7,"n_rows":35,"n_cols":3,"rows_kept":35,"cut":false,"hidden":true,"merged":[]}
["Select","Catchment Provider Resource Level Lv1 ",0]
["Select","Catchment Provider Resource Level Lv2",0]
["Select","Catchment Provider Resource Level Lv3",0]
["Select","Catchment Provider Resource Level Lv4",0]
["Select","Catchment Provider Resource Level Lv5",0]
["Select","Catchment Provider Resource Level Lv6",0]
["Select","Catchment Provider Resource Level Lv7",0]
["Zone 1","Catchment Provider Resource Level Lv1 ",257]
["Zone 1","Catchment Provider Resource Level Lv2",277]
["Zone 1","Catchment Provider Resource Level Lv3",300]
["Zone 1","Catchment Provider Resource Level Lv4",328]
["Zone 1","Catchment Provider Resource Level Lv5",407]
["Zone 1","Catchment Provider Resource Level Lv6",433]
["Zone 1","Catchment Provider Resource Level Lv7",500]
["Zone 2","Catchment Provider Resource Level Lv1 ",275]
["Zone 2","Catchment Provider Resource Level Lv2",296]
["Zone 2","Catchment Provider Resource Level Lv3",320]
["Zone 2","Catchment Provider Resource Level Lv4",350]
["Zone 2","Catchment Provider Resource Level Lv5",434]
["Zone 2","Catchment Provider Resource Level Lv6",462]
{"$rows_left_out":15}